Reaction Details
TargetD(2) dopamine receptor
LigandBDBM50109019
Substrate/Competitorn/a
Meas. Tech.ChEBML_62080
Ki 5.8±n/a nM
Citation Mewshaw, REZhao, RShi, XMarquis, KBrennan, JAMazandarani, HCoupet, JAndree, TH New generation dopaminergic agents. Part 8: heterocyclic bioisosteres that exploit the 7-OH-2-(aminomethyl)chroman D(2) template. Bioorg Med Chem Lett12:271-4 (2002) D(2) dopamine receptor
Name:D(2) dopamine receptor
Type:G Protein-Coupled Receptor (GPCR)
Mol. Mass.:50931.60
Organism:Rattus norvegicus (rat)
Description:P61169
Residue:444
BDBM50109019
NameBDBM50109019
Synonyms:Benzyl-(2-trifluoromethyl-3,6,7,8-tetrahydro-chromeno[7,8-d]imidazol-8-ylmethyl)-amine | CHEMBL313851
TypeSmall organic molecule
Emp. Form.C19H18F3N3O
Mol. Mass.361.3609
SMILESFC(F)(F)c1nc2ccc3CCC(CNCc4ccccc4)Oc3c2[nH]1