Reaction Details
TargetcAMP-specific 3',5'-cyclic phosphodiesterase 4B
LigandBDBM14361
Substrate/Competitorn/a
Meas. Tech.ChEBML_222610
IC50 741±n/a nM
Citation Andrés, JIAlonso, JMDíaz, AFernández, JIturrino, LMartínez, PMatesanz, EFreyne, EJDeroose, FBoeckx, GPetit, DDiels, GMegens, ASomers, MVan Wauwe, JStoppie, PCools, MDe Clerck, FPeeters, Dde Chaffoy, D Synthesis and biological evaluation of imidazol-2-one and 2-cyanoiminoimidazole derivatives: novel series of PDE4 inhibitors. Bioorg Med Chem Lett12:653-8 (2002) cAMP-specific 3',5'-cyclic phosphodiesterase 4B
Name:cAMP-specific 3',5'-cyclic phosphodiesterase 4B
Type:Protein
Mol. Mass.:83318.87
Organism:Homo sapiens (Human)
Description:Q07343
Residue:736
BDBM14361
NameBDBM14361
Synonyms:(R,S)-Rolipram 4-[3-(cyclopentyloxy)-4-methoxyphenyl]pyrrolidin-2-one CHEMBL63 | Rolipram
TypeSmall organic molecule
Emp. Form.C16H21NO3
Mol. Mass.275.3428
SMILESCOc1ccc(cc1OC1CCCC1)C1CNC(=O)C1