Reaction Details
TargetGlutamate receptor ionotropic, NMDA 1/2A
LigandBDBM50451503
Substrate/Competitorn/a
Meas. Tech.ChEMBL_141918 (CHEMBL750561)
IC50 0.200000±n/a nM
Citation Auberson, YPAllgeier, HBischoff, SLingenhoehl, KMoretti, RSchmutz, M 5-Phosphonomethylquinoxalinediones as competitive NMDA receptor antagonists with a preference for the human 1A/2A, rather than 1A/2B receptor composition. Bioorg Med Chem Lett12:1099-102 (2002) Glutamate receptor ionotropic, NMDA 1/2A
Name:Glutamate receptor ionotropic, NMDA 1/2A
Type:Protein
Mol. Mass.:n/a
Description:n/a
Components:This complex has 2 components.
Component 1
Name:Glutamate receptor ionotropic, NMDA 1
Synonyms:GRIN1 Glutamate [NMDA] receptor subunit zeta-1 N-methyl-D-aspartate receptor subunit NR1 NMDZ1_HUMAN | phencyclidine
Type:Enzyme Catalytic Domain
Mol. Mass.:105397.81
Organism:Homo sapiens (Human)
Description:Q05586
Residue:938
Component 2
Name:Glutamate receptor ionotropic, NMDA 2A
Synonyms:GRIN2A Glutamate [NMDA] receptor Glutamate [NMDA] receptor subunit epsilon-1 NMDA receptor subtype 2A protein (NR2A) NMDE1_HUMAN hNR2A
Type:n/a
Mol. Mass.:165293.76
Organism:Homo sapiens (Human)
Description:n/a
Residue:1464
BDBM50451503
NameBDBM50451503
Synonyms:CHEMBL12513
TypeSmall organic molecule
Emp. Form.C15H12ClN2O5P
Mol. Mass.366.693
SMILESOc1nc2cc(cc(CP(O)(O)=O)c2nc1O)-c1ccc(Cl)cc1