Reaction Details
TargetReverse transcriptase/RNaseH
LigandBDBM50366817
Substrate/Competitorn/a
Meas. Tech.ChEMBL_197276 (CHEMBL804263)
EC50 42±n/a nM
Citation Choo, HChong, YChu, CK The role of 2',3'-unsaturation on the antiviral activity of anti-HIV nucleosides against 3TC-resistant mutant (M184V). Bioorg Med Chem Lett13:1993-6 (2003) Reverse transcriptase/RNaseH
Name:Reverse transcriptase/RNaseH
Type:PROTEIN
Mol. Mass.:65229.15
Organism:Human immunodeficiency virus 1
Description:ChEMBL_1473730
Residue:566
BDBM50366817
NameBDBM50366817
Synonyms:Epivir
TypeSmall organic molecule
Emp. Form.C8H11N3O3S
Mol. Mass.229.256
SMILESNc1ccn([C@@H]2CS[C@H](CO)O2)c(=O)n1