Reaction Details
TargetReverse transcriptase/RNaseH
LigandBDBM50366816
Substrate/Competitorn/a
Meas. Tech.ChEBML_197275
EC50 15500±n/a nM
Citation Choo, HChong, YChu, CK The role of 2',3'-unsaturation on the antiviral activity of anti-HIV nucleosides against 3TC-resistant mutant (M184V). Bioorg Med Chem Lett13:1993-6 (2003) Reverse transcriptase/RNaseH
Name:Reverse transcriptase/RNaseH
Type:PROTEIN
Mol. Mass.:65229.15
Organism:Human immunodeficiency virus 1
Description:ChEMBL_1473730
Residue:566
BDBM50366816
NameBDBM50366816
Synonyms:ABACAVIR Ziagen
TypeSmall organic molecule
Emp. Form.C14H18N6O
Mol. Mass.286.3323
SMILESNc1nc(NC2CC2)c2ncn([C@@H]3C[C@H](CO)C=C3)c2n1