Reaction Details
TargetProgesterone receptor
LigandBDBM50129145
Substrate/Competitorn/a
Meas. Tech.ChEMBL_159551 (CHEMBL765839)
Ki 2.5±n/a nM
Citation Zhi, LTegley, CMPio, BEdwards, JPJones, TKMarschke, KBMais, DERisek, BSchrader, WT Synthesis and biological activity of 5-methylidene 1,2-dihydrochromeno[3,4-f]quinoline derivatives as progesterone receptor modulators. Bioorg Med Chem Lett13:2071-4 (2003) Progesterone receptor
Name:Progesterone receptor
Type:Protein
Mol. Mass.:98979.52
Organism:Homo sapiens (Human)
Description:P06401
Residue:933
BDBM50129145
NameBDBM50129145
Synonyms:9-Fluoro-2,2,4-trimethyl-5-((Z)-3-methyl-but-2-enylidene)-2,5-dihydro-1H-6-oxa-1-aza-chrysene | CHEMBL65690
TypeSmall organic molecule
Emp. Form.C24H24FNO
Mol. Mass.361.4519
SMILES[#6]\[#6](-[#6])=[#6]\[#6]=[#6]-1/[#8]-c2ccc(F)cc2-c2ccc3-[#7]C([#6])([#6])[#6]=[#6](-[#6])-c3c-12