Reaction Details
TargetProgesterone receptor
LigandBDBM50067684
Substrate/Competitorn/a
Meas. Tech.ChEBML_159551
Ki 0.660000±n/a nM
Citation Zhi, LTegley, CMPio, BEdwards, JPJones, TKMarschke, KBMais, DERisek, BSchrader, WT Synthesis and biological activity of 5-methylidene 1,2-dihydrochromeno[3,4-f]quinoline derivatives as progesterone receptor modulators. Bioorg Med Chem Lett13:2071-4 (2003) Progesterone receptor
Name:Progesterone receptor
Type:Protein
Mol. Mass.:98979.52
Organism:Homo sapiens (Human)
Description:P06401
Residue:933
BDBM50067684
NameBDBM50067684
Synonyms:2,2,4-Trimethyl-5-[1-o-tolyl-meth-(Z)-ylidene]-2,5-dihydro-1H-6-oxa-1-aza-chrysene LG-120838
TypeSmall organic molecule
Emp. Form.C27H25NO
Mol. Mass.379.4935
SMILESCC1=CC(C)(C)Nc2ccc3-c4ccccc4O\C(=C/c4ccccc4C)c3c12