Reaction Details
TargetAcyl carrier protein,/NADH dehydrogenase [ubiquinone] flavoprotein 1, mitochondrial
LigandBDBM50366820
Substrate/Competitorn/a
Meas. Tech.ChEMBL_141733 (CHEMBL749246)
IC50 0.900000±n/a nM
Citation Yabunaka, HAbe, MKenmochi, AHamada, TNishioka, TMiyoshi, H Synthesis and inhibitory activity of ubiquinone-acetogenin hybrid inhibitor with bovine mitochondrial complex I. Bioorg Med Chem Lett13:2385-8 (2003) Acyl carrier protein,/NADH dehydrogenase [ubiquinone] flavoprotein 1, mitochondrial
Name:Acyl carrier protein,/NADH dehydrogenase [ubiquinone] flavoprotein 1, mitochondrial
Synonyms:Mitochondrial complex I; NADH oxidoreductase
Type:n/a
Mol. Mass.:n/a
Description:ASSAY_ID of EBI is 141738
Components:This complex has 2 components.
Component 1
Name:NADH dehydrogenase [ubiquinone] flavoprotein 1, mitochondrial
Type:PROTEIN
Mol. Mass.:50659.85
Organism:Bos taurus
Description:EBI_100771
Residue:464
Component 2
Name:Acyl carrier protein, mitochondrial
Synonyms:ACP CI-SDAP NDUFAB1
Type:PROTEIN
Mol. Mass.:17397.64
Organism:Bos taurus
Description:ChEMBL_469770
Residue:156
BDBM50366820
NameBDBM50366820
Synonyms:BULLATACIN
TypeSmall organic molecule
Emp. Form.C36H64O7
Mol. Mass.608.8892
SMILESCCCCCCCCCC[C@@H](O)[C@@H]1CC[C@H](O1)[C@@H]1CC[C@H](O1)[C@H](O)CCCCCCCCCC(O)CC1=CC(C)OC1=O