Reaction Details
TargetDihydrofolate reductase
LigandBDBM18046
Substrate/Competitorn/a
Meas. Tech.ChEMBL_54392 (CHEMBL668776)
IC50 310±n/a nM
Citation Zolli-Juran, MCechetto, JDHartlen, RDaigle, DMBrown, ED High throughput screening identifies novel inhibitors of Escherichia coli dihydrofolate reductase that are competitive with dihydrofolate. Bioorg Med Chem Lett13:2493-6 (2003) Dihydrofolate reductase
Name:Dihydrofolate reductase
Type:n/a
Mol. Mass.:17532.46
Organism:Escherichia coli
Description:n/a
Residue:157
BDBM18046
NameBDBM18046
Synonyms:5-((4-methylphenyl)thio)-quinazoline 2,4-diamine, 1 5-[(4-methylphenyl)sulfanyl]quinazoline-2,4-diamine CHEMBL83547 | GW578
TypeSmall organic molecule
Emp. Form.C15H14N4S
Mol. Mass.282.363
SMILESCc1ccc(Sc2cccc3nc(N)nc(N)c23)cc1