Reaction Details
TargetProthrombin
LigandBDBM50131465
Substrate/Competitorn/a
Meas. Tech.ChEBML_208517
Ki 0.630000±n/a nM
Citation Nantermet, PGBarrow, JCNewton, CLPellicore, JMYoung, MLewis, SDLucas, BJKrueger, JAMcMasters, DRYan, YKuo, LCVacca, JPSelnick, HG Design and synthesis of potent and selective macrocyclic thrombin inhibitors. Bioorg Med Chem Lett13:2781-4 (2003) Prothrombin
Name:Prothrombin
Type:Protein
Mol. Mass.:70029.57
Organism:Homo sapiens (Human)
Description:P00734
Residue:622
BDBM50131465
NameBDBM50131465
Synonyms:(S)-21-Benzyl-8,26-dichloro-12,17-dioxa-1,4,19,22,24-pentaaza-tricyclo[21.3.1.0*6,11*]heptacosa-6(11),7,9,23,25-pentaene-3,18,27-trione | CHEMBL94413
TypeSmall organic molecule
Emp. Form.C27H29Cl2N5O5
Mol. Mass.574.456
SMILESClc1ccc2OCCCCOC(=O)NC[C@H](Cc3ccccc3)Nc3ncc(Cl)n(CC(=O)NCc2c1)c3=O