Reaction Details
TargetProthrombin
LigandBDBM50131474
Substrate/Competitorn/a
Meas. Tech.ChEBML_208517
Ki 0.510000±n/a nM
Citation Nantermet, PGBarrow, JCNewton, CLPellicore, JMYoung, MLewis, SDLucas, BJKrueger, JAMcMasters, DRYan, YKuo, LCVacca, JPSelnick, HG Design and synthesis of potent and selective macrocyclic thrombin inhibitors. Bioorg Med Chem Lett13:2781-4 (2003) Prothrombin
Name:Prothrombin
Type:Protein
Mol. Mass.:70029.57
Organism:Homo sapiens (Human)
Description:P00734
Residue:622
BDBM50131474
NameBDBM50131474
Synonyms:(S)-20-Benzyl-25-chloro-1,4,13,18,21,23-hexaaza-tricyclo[20.3.1.0*6,11*]hexacosa-6(11),7,9,22,24-pentaene-3,26-dione | CHEMBL329912
TypeSmall organic molecule
Emp. Form.C27H33ClN6O2
Mol. Mass.509.043
SMILESClc1cnc2N[C@@H](Cc3ccccc3)CNCCCCNCc3ccccc3CNC(=O)Cn1c2=O