Reaction Details
TargetProthrombin
LigandBDBM50131475
Substrate/Competitorn/a
Meas. Tech.ChEBML_208517
Ki 0.740000±n/a nM
Citation Nantermet, PGBarrow, JCNewton, CLPellicore, JMYoung, MLewis, SDLucas, BJKrueger, JAMcMasters, DRYan, YKuo, LCVacca, JPSelnick, HG Design and synthesis of potent and selective macrocyclic thrombin inhibitors. Bioorg Med Chem Lett13:2781-4 (2003) Prothrombin
Name:Prothrombin
Type:Protein
Mol. Mass.:70029.57
Organism:Homo sapiens (Human)
Description:P00734
Residue:622
BDBM50131475
NameBDBM50131475
Synonyms:CHEMBL96893 | Ethyl-carbamic acid 2-({[(S)-1-((S)-3-amino-3-cyclohexyl-propionyl)-py rrolidine-2-carbonyl]-amino}-methyl)-4-chloro-phenyl ester
TypeSmall organic molecule
Emp. Form.C23H33ClN4O4
Mol. Mass.464.986
SMILESCCNC(=O)Oc1ccc(Cl)cc1CNC(=O)[C@@H]1CCCN1C(=O)[C@@H](N)C1CCCCC1