Reaction Details
TargetTyrosine-protein kinase SYK
LigandBDBM50132445
Substrate/Competitorn/a
Meas. Tech.ChEBML_206946
IC50 28±n/a nM
Citation Lai, JYCox, PJPatel, RSadiq, SAldous, DJThurairatnam, SSmith, KWheeler, DJagpal, SParveen, SFenton, GHarrison, TKMcCarthy, CBamborough, P Potent small molecule inhibitors of spleen tyrosine kinase (Syk). Bioorg Med Chem Lett13:3111-4 (2003) Tyrosine-protein kinase SYK
Name:Tyrosine-protein kinase SYK
Type:Enzyme
Mol. Mass.:72079.99
Organism:Homo sapiens (Human)
Description:P43405
Residue:635
BDBM50132445
NameBDBM50132445
Synonyms:3-[1-(5-Methoxy-1H-indol-3-yl)-meth-(Z)-ylidene]-2-oxo-2,3-dihydro-1H-indole-5-sulfonic acid amide | CHEMBL106226
TypeSmall organic molecule
Emp. Form.C18H15N3O4S
Mol. Mass.369.394
SMILESCOc1ccc2[nH]cc(\C=C3/C(=O)Nc4ccc(cc34)S(N)(=O)=O)c2c1