Reaction Details
TargetLow affinity immunoglobulin epsilon Fc receptor
LigandBDBM50132449
Substrate/Competitorn/a
Meas. Tech.ChEBML_163803
EC50 5600±n/a nM
Citation Lai, JYCox, PJPatel, RSadiq, SAldous, DJThurairatnam, SSmith, KWheeler, DJagpal, SParveen, SFenton, GHarrison, TKMcCarthy, CBamborough, P Potent small molecule inhibitors of spleen tyrosine kinase (Syk). Bioorg Med Chem Lett13:3111-4 (2003) Low affinity immunoglobulin epsilon Fc receptor
Name:Low affinity immunoglobulin epsilon Fc receptor
Type:PROTEIN
Mol. Mass.:36461.84
Organism:Homo sapiens (Human)
Description:ChEMBL_88888
Residue:321
BDBM50132449
NameBDBM50132449
Synonyms:3-((1-(4-morpholino-4-oxobutyl)-1H-indol-3-yl)methylene)-2-oxoindoline-5-sulfonamide CHEMBL322152
TypeSmall organic molecule
Emp. Form.C25H26N4O5S
Mol. Mass.494.563
SMILESNS(=O)(=O)c1ccc2NC(=O)\C(=C/c3cn(CCCC(=O)N4CCOCC4)c4ccccc34)c2c1