Reaction Details
TargetLow affinity immunoglobulin epsilon Fc receptor
LigandBDBM50132451
Substrate/Competitorn/a
Meas. Tech.ChEBML_163803
EC50 100±n/a nM
Citation Lai, JYCox, PJPatel, RSadiq, SAldous, DJThurairatnam, SSmith, KWheeler, DJagpal, SParveen, SFenton, GHarrison, TKMcCarthy, CBamborough, P Potent small molecule inhibitors of spleen tyrosine kinase (Syk). Bioorg Med Chem Lett13:3111-4 (2003) Low affinity immunoglobulin epsilon Fc receptor
Name:Low affinity immunoglobulin epsilon Fc receptor
Type:PROTEIN
Mol. Mass.:36461.84
Organism:Homo sapiens (Human)
Description:ChEMBL_88888
Residue:321
BDBM50132451
NameBDBM50132451
Synonyms:3-((5-methoxy-1-methyl-1H-indol-3-yl)methylene)-N-methyl-2-oxoindoline-5-carboxamide CHEMBL318079
TypeSmall organic molecule
Emp. Form.C21H19N3O3
Mol. Mass.361.3939
SMILESCNC(=O)c1ccc2NC(=O)\C(=C/c3cn(C)c4ccc(OC)cc34)c2c1