Reaction Details
TargetPeptidyl-prolyl cis-trans isomerase A
LigandBDBM50136483
Substrate/Competitorn/a
Meas. Tech.ChEBML_92658
IC50 43.0±n/a nM
Citation Evers, MBarrière, JCBashiardes, GBousseau, ACarry, JCDereu, NFiloche, BHenin, YSablé, SVuilhorgne, MMignani, S Synthesis of non-immunosuppressive cyclophilin-Binding cyclosporin A derivatives as potential anti-HIV-1 drugs. Bioorg Med Chem Lett13:4415-9 (2003) Peptidyl-prolyl cis-trans isomerase A
Name:Peptidyl-prolyl cis-trans isomerase A
Type:Protein
Mol. Mass.:18015.32
Organism:Homo sapiens (Human)
Description:P62937
Residue:165
BDBM50136483
NameBDBM50136483
Synonyms:CHEMBL3038083 | [(40-OH) MeLeu]4-CsA derivatives
TypeSmall organic molecule
Emp. Form.C69H126N12O13S
Mol. Mass.1363.876
SMILESCC[C@@H]1NC(=O)[C@H]([C@H](O)[C@H](C)C\C=C\C)N(C)C(=O)[C@H](C(C)C)N(C)C(=O)[C@H](CC(C)C)N(C)C(=O)[C@H](CC(C)C)N(C)C(=O)[C@@H](C)NC(=O)[C@H](C)NC(=O)[C@H](CC(C)C)N(C)C(=O)[C@@H](NC(=O)[C@H](CC(C)(C)O)N(C)C(=O)[C@@H](SCCN(C)C(C)(C)C)N(C)C1=O)C(C)C