Reaction Details
TargetReverse transcriptase/RNaseH
LigandBDBM50136479
Substrate/Competitorn/a
Meas. Tech.ChEBML_195221
IC50 20±n/a nM
Citation Evers, MBarrière, JCBashiardes, GBousseau, ACarry, JCDereu, NFiloche, BHenin, YSablé, SVuilhorgne, MMignani, S Synthesis of non-immunosuppressive cyclophilin-Binding cyclosporin A derivatives as potential anti-HIV-1 drugs. Bioorg Med Chem Lett13:4415-9 (2003) Reverse transcriptase/RNaseH
Name:Reverse transcriptase/RNaseH
Type:PROTEIN
Mol. Mass.:65229.15
Organism:Human immunodeficiency virus 1
Description:ChEMBL_1473730
Residue:566
BDBM50136479
NameBDBM50136479
Synonyms:CHEMBL3038084 | Cyclosporin A analogue
TypeSmall organic molecule
Emp. Form.C68H124N12O12S
Mol. Mass.1333.85
SMILESCC[C@@H]1NC(=O)[C@H]([C@H](O)[C@H](C)C\C=C\C)N(C)C(=O)[C@H](C(C)C)N(C)C(=O)[C@H](CC(C)C)N(C)C(=O)[C@H](CC(C)C)N(C)C(=O)[C@@H](C)NC(=O)[C@H](C)NC(=O)[C@H](CC(C)C)N(C)C(=O)[C@@H](NC(=O)[C@H](CC(C)C)N(C)C(=O)[C@@H](SCCN(C)C(C)C)N(C)C1=O)C(C)C