Reaction Details
TargetPeptidyl-prolyl cis-trans isomerase A
LigandBDBM50136490
Substrate/Competitorn/a
Meas. Tech.ChEBML_92658
IC50 3±n/a nM
Citation Evers, MBarrière, JCBashiardes, GBousseau, ACarry, JCDereu, NFiloche, BHenin, YSablé, SVuilhorgne, MMignani, S Synthesis of non-immunosuppressive cyclophilin-Binding cyclosporin A derivatives as potential anti-HIV-1 drugs. Bioorg Med Chem Lett13:4415-9 (2003) Peptidyl-prolyl cis-trans isomerase A
Name:Peptidyl-prolyl cis-trans isomerase A
Type:Protein
Mol. Mass.:18015.32
Organism:Homo sapiens (Human)
Description:P62937
Residue:165
BDBM50136490
NameBDBM50136490
Synonyms:CHEMBL3038087 | Cyclosporin A analogue
TypeSmall organic molecule
Emp. Form.C63H113N11O12S
Mol. Mass.1248.703
SMILESCC[C@@H]1NC(=O)[C@H]([C@H](O)[C@H](C)C\C=C\C)N(C)C(=O)[C@H](C(C)C)N(C)C(=O)[C@H](CC(C)C)N(C)C(=O)[C@H](CC(C)C)N(C)C(=O)[C@@H](C)NC(=O)[C@H](C)NC(=O)[C@H](CC(C)C)N(C)C(=O)[C@@H](NC(=O)[C@H](CC(C)C)N(C)C(=O)[C@@H](SC)N(C)C1=O)C(C)C