Reaction Details
TargetReverse transcriptase/RNaseH
LigandBDBM50136489
Substrate/Competitorn/a
Meas. Tech.ChEBML_195221
IC50 84±n/a nM
Citation Evers, MBarrière, JCBashiardes, GBousseau, ACarry, JCDereu, NFiloche, BHenin, YSablé, SVuilhorgne, MMignani, S Synthesis of non-immunosuppressive cyclophilin-Binding cyclosporin A derivatives as potential anti-HIV-1 drugs. Bioorg Med Chem Lett13:4415-9 (2003) Reverse transcriptase/RNaseH
Name:Reverse transcriptase/RNaseH
Type:PROTEIN
Mol. Mass.:65229.15
Organism:Human immunodeficiency virus 1
Description:ChEMBL_1473730
Residue:566
BDBM50136489
NameBDBM50136489
Synonyms:CHEMBL2407585 | Cyclosporin A analogue
TypeSmall organic molecule
Emp. Form.C63H113N11O13S
Mol. Mass.1264.702
SMILES[H][C@@]1([C@H](O)[C@H](C)C\C=C\C)N(C)C(=O)[C@H](C(C)C)N(C)C(=O)[C@H](CC(C)C)N(C)C(=O)[C@H](CC(C)C)N(C)C(=O)[C@@H](C)NC(=O)[C@H](C)NC(=O)[C@H](CC(C)C)N(C)C(=O)[C@@H](NC(=O)[C@H](CC(C)(C)O)N(C)C(=O)[C@@H](SC)N(C)C(=O)[C@H](CC)NC1=O)C(C)C