Reaction Details
TargetC-C chemokine receptor type 5
LigandBDBM50124942
Substrate/Competitorn/a
Meas. Tech.ChEBML_39654
Ki 8.1±n/a nM
Citation Palani, AShapiro, SClader, JWGreenlee, WJVice, SMcCombie, SCox, KStrizki, JBaroudy, BM Oximino-piperidino-piperidine-based CCR5 antagonists. Part 2: synthesis, SAR and biological evaluation of symmetrical heteroaryl carboxamides. Bioorg Med Chem Lett13:709-12 (2003) C-C chemokine receptor type 5
Name:C-C chemokine receptor type 5
Type:Enzyme
Mol. Mass.:40540.21
Organism:Homo sapiens (Human)
Description:P51681
Residue:352
BDBM50124942
NameBDBM50124942
Synonyms:(4-{(4-Bromo-phenyl)-[(E)-isobutoxyimino]-methyl}-4'-methyl-[1,4']bipiperidinyl-1'-yl)-(4,6-dimethyl-pyrimidin-5-yl)-methanone | CHEMBL341758
TypeSmall organic molecule
Emp. Form.C29H40BrN5O2
Mol. Mass.570.564
SMILESCC(C)CO\N=C(/C1CCN(CC1)C1(C)CCN(CC1)C(=O)c1c(C)ncnc1C)c1ccc(Br)cc1