Reaction Details
TargetC-C chemokine receptor type 5
LigandBDBM50124944
Substrate/Competitorn/a
Meas. Tech.ChEBML_39654
Ki 43±n/a nM
Citation Palani, AShapiro, SClader, JWGreenlee, WJVice, SMcCombie, SCox, KStrizki, JBaroudy, BM Oximino-piperidino-piperidine-based CCR5 antagonists. Part 2: synthesis, SAR and biological evaluation of symmetrical heteroaryl carboxamides. Bioorg Med Chem Lett13:709-12 (2003) C-C chemokine receptor type 5
Name:C-C chemokine receptor type 5
Type:Enzyme
Mol. Mass.:40540.21
Organism:Homo sapiens (Human)
Description:P51681
Residue:352
BDBM50124944
NameBDBM50124944
Synonyms:(4-{(4-Bromo-phenyl)-[(E)-ethoxyimino]-methyl}-4'-methyl-[1,4']bipiperidinyl-1'-yl)-(2-isopropyl-4,6-dimethyl-pyrimidin-5-yl)-methanone | CHEMBL139701
TypeSmall organic molecule
Emp. Form.C30H42BrN5O2
Mol. Mass.584.591
SMILESCCO\N=C(/C1CCN(CC1)C1(C)CCN(CC1)C(=O)c1c(C)nc(nc1C)C(C)C)c1ccc(Br)cc1