Reaction Details
TargetC-C chemokine receptor type 5
LigandBDBM50124943
Substrate/Competitorn/a
Meas. Tech.ChEBML_39654
Ki 0.300000±n/a nM
Citation Palani, AShapiro, SClader, JWGreenlee, WJVice, SMcCombie, SCox, KStrizki, JBaroudy, BM Oximino-piperidino-piperidine-based CCR5 antagonists. Part 2: synthesis, SAR and biological evaluation of symmetrical heteroaryl carboxamides. Bioorg Med Chem Lett13:709-12 (2003) C-C chemokine receptor type 5
Name:C-C chemokine receptor type 5
Type:Enzyme
Mol. Mass.:40540.21
Organism:Homo sapiens (Human)
Description:P51681
Residue:352
BDBM50124943
NameBDBM50124943
Synonyms:(4-{(4-Bromo-phenyl)-[(Z)-ethoxyimino]-methyl}-4'-methyl-[1,4']bipiperidinyl-1'-yl)-(3,5-dibromo-pyridin-4-yl)-methanone | CHEMBL349008
TypeSmall organic molecule
Emp. Form.C26H31Br3N4O2
Mol. Mass.671.262
SMILESCCO\N=C(\C1CCN(CC1)C1(C)CCN(CC1)C(=O)c1c(Br)cncc1Br)c1ccc(Br)cc1