Reaction Details
TargetC-C chemokine receptor type 5
LigandBDBM50124948
Substrate/Competitorn/a
Meas. Tech.ChEBML_39654
Ki 2.2±n/a nM
Citation Palani, AShapiro, SClader, JWGreenlee, WJVice, SMcCombie, SCox, KStrizki, JBaroudy, BM Oximino-piperidino-piperidine-based CCR5 antagonists. Part 2: synthesis, SAR and biological evaluation of symmetrical heteroaryl carboxamides. Bioorg Med Chem Lett13:709-12 (2003) C-C chemokine receptor type 5
Name:C-C chemokine receptor type 5
Type:Enzyme
Mol. Mass.:40540.21
Organism:Homo sapiens (Human)
Description:P51681
Residue:352
BDBM50124948
NameBDBM50124948
Synonyms:(4-{(4-Bromo-phenyl)-[(Z)-ethoxyimino]-methyl}-4'-methyl-[1,4']bipiperidinyl-1'-yl)-(4,6-dimethyl-pyrimidin-5-yl)-methanone | CHEMBL351625
TypeSmall organic molecule
Emp. Form.C27H36BrN5O2
Mol. Mass.542.511
SMILESCCO\N=C(\C1CCN(CC1)C1(C)CCN(CC1)C(=O)c1c(C)ncnc1C)c1ccc(Br)cc1