Reaction Details
TargetC-C chemokine receptor type 5
LigandBDBM50124962
Substrate/Competitorn/a
Meas. Tech.ChEBML_39654
Ki 60±n/a nM
Citation Palani, AShapiro, SClader, JWGreenlee, WJVice, SMcCombie, SCox, KStrizki, JBaroudy, BM Oximino-piperidino-piperidine-based CCR5 antagonists. Part 2: synthesis, SAR and biological evaluation of symmetrical heteroaryl carboxamides. Bioorg Med Chem Lett13:709-12 (2003) C-C chemokine receptor type 5
Name:C-C chemokine receptor type 5
Type:Enzyme
Mol. Mass.:40540.21
Organism:Homo sapiens (Human)
Description:P51681
Residue:352
BDBM50124962
NameBDBM50124962
Synonyms:CHEMBL140201 | N-[5-(4-{(4-Bromo-phenyl)-[(E)-ethoxyimino]-methyl}-4'-methyl-[1,4']bipiperidinyl-1'-carbonyl)-4,6-dimethyl-pyrimidin-2-yl]-acetamide
TypeSmall organic molecule
Emp. Form.C29H39BrN6O3
Mol. Mass.599.562
SMILESCCO\N=C(/C1CCN(CC1)C1(C)CCN(CC1)C(=O)c1c(C)nc(NC(C)=O)nc1C)c1ccc(Br)cc1