Reaction Details
TargetC-C chemokine receptor type 5
LigandBDBM50124960
Substrate/Competitorn/a
Meas. Tech.ChEBML_39654
Ki 11±n/a nM
Citation Palani, AShapiro, SClader, JWGreenlee, WJVice, SMcCombie, SCox, KStrizki, JBaroudy, BM Oximino-piperidino-piperidine-based CCR5 antagonists. Part 2: synthesis, SAR and biological evaluation of symmetrical heteroaryl carboxamides. Bioorg Med Chem Lett13:709-12 (2003) C-C chemokine receptor type 5
Name:C-C chemokine receptor type 5
Type:Enzyme
Mol. Mass.:40540.21
Organism:Homo sapiens (Human)
Description:P51681
Residue:352
BDBM50124960
NameBDBM50124960
Synonyms:(4-{(4-Bromo-phenyl)-[(E)-cyclopropylmethoxyimino]-methyl}-4'-methyl-[1,4']bipiperidinyl-1'-yl)-(4,6-dimethyl-pyrimidin-5-yl)-methanone | CHEMBL344435
TypeSmall organic molecule
Emp. Form.C29H38BrN5O2
Mol. Mass.568.548
SMILESCc1ncnc(C)c1C(=O)N1CCC(C)(CC1)N1CCC(CC1)C(=N/OCC1CC1)\c1ccc(Br)cc1