Reaction Details
TargetC-C chemokine receptor type 5
LigandBDBM50124950
Substrate/Competitorn/a
Meas. Tech.ChEBML_39654
Ki 5.7±n/a nM
Citation Palani, AShapiro, SClader, JWGreenlee, WJVice, SMcCombie, SCox, KStrizki, JBaroudy, BM Oximino-piperidino-piperidine-based CCR5 antagonists. Part 2: synthesis, SAR and biological evaluation of symmetrical heteroaryl carboxamides. Bioorg Med Chem Lett13:709-12 (2003) C-C chemokine receptor type 5
Name:C-C chemokine receptor type 5
Type:Enzyme
Mol. Mass.:40540.21
Organism:Homo sapiens (Human)
Description:P51681
Residue:352
BDBM50124950
NameBDBM50124950
Synonyms:(2-Amino-4,6-dimethyl-pyrimidin-5-yl)-(4-{(4-bromo-phenyl)-[(E)-ethoxyimino]-methyl}-4'-methyl-[1,4']bipiperidinyl-1'-yl)-methanone | CHEMBL141683
TypeSmall organic molecule
Emp. Form.C27H37BrN6O2
Mol. Mass.557.526
SMILESCCO\N=C(/C1CCN(CC1)C1(C)CCN(CC1)C(=O)c1c(C)nc(N)nc1C)c1ccc(Br)cc1