Reaction Details
TargetSodium-dependent serotonin transporter
LigandBDBM50451852
Substrate/Competitorn/a
Meas. Tech.ChEBML_201998
Ki 0.200000±n/a nM
Citation Timms, GHBoot, JRBroadmore, RJCarney, SLCooper, JFindlay, JDGilmore, JMitchell, SMoore, NAPullar, ISanger, GJTomlinson, RTree, BBWedley, S SAR development of a selective 5-HT1D antagonist/serotonin reuptake inhibitor lead using rapid parallel synthesis. Bioorg Med Chem Lett14:2469-72 (2004) 
 
Sodium-dependent serotonin transporter
Name:Sodium-dependent serotonin transporter
Type:Multi-pass membrane protein
Mol. Mass.:70168.43
Organism:Rattus norvegicus (rat)
Description:P31652
Residue:630
BDBM50451852
NameBDBM50451852
Synonyms:CHEMBL1159649
TypeSmall organic molecule
Emp. Form.C25H26FN3O2
Mol. Mass.419.4912
SMILESNC(=O)c1ccc2[C@@H](CCN3CCC(=CC3)c3c[nH]c4c(F)cccc34)OCCc2c1