Reaction Details
Target5-hydroxytryptamine receptor 1D
LigandBDBM50145333
Substrate/Competitorn/a
Meas. Tech.ChEBML_1712
Ki 5.4±n/a nM
Citation Timms, GHBoot, JRBroadmore, RJCarney, SLCooper, JFindlay, JDGilmore, JMitchell, SMoore, NAPullar, ISanger, GJTomlinson, RTree, BBWedley, S SAR development of a selective 5-HT1D antagonist/serotonin reuptake inhibitor lead using rapid parallel synthesis. Bioorg Med Chem Lett14:2469-72 (2004) 
 
5-hydroxytryptamine receptor 1D
Name:5-hydroxytryptamine receptor 1D
Type:G Protein-Coupled Receptor (GPCR)
Mol. Mass.:41920.63
Organism:Homo sapiens (Human)
Description:Receptor binding assays were performed using human clone stably expressed in CHO cells.
Residue:377
BDBM50145333
NameBDBM50145333
Synonyms:1-[2-(4-Naphthalen-1-yl-3,6-dihydro-2H-pyridin-1-yl)-ethyl]-isochroman-6-carboxylic acid amide | CHEMBL81191
TypeSmall organic molecule
Emp. Form.C27H28N2O2
Mol. Mass.412.5234
SMILESNC(=O)c1ccc2C(CCN3CCC(=CC3)c3cccc4ccccc34)OCCc2c1