Reaction Details
TargetD(2) dopamine receptor
LigandBDBM50145336
Substrate/Competitorn/a
Meas. Tech.ChEBML_62254
Ki 3.8±n/a nM
Citation Timms, GHBoot, JRBroadmore, RJCarney, SLCooper, JFindlay, JDGilmore, JMitchell, SMoore, NAPullar, ISanger, GJTomlinson, RTree, BBWedley, S SAR development of a selective 5-HT1D antagonist/serotonin reuptake inhibitor lead using rapid parallel synthesis. Bioorg Med Chem Lett14:2469-72 (2004) 
 
D(2) dopamine receptor
Name:D(2) dopamine receptor
Type:G Protein-Coupled Receptor (GPCR)
Mol. Mass.:50931.60
Organism:Rattus norvegicus (rat)
Description:P61169
Residue:444
BDBM50145336
NameBDBM50145336
Synonyms:1-{2-[4-(6-Fluoro-benzo[b]thiophen-3-yl)-3,6-dihydro-2H-pyridin-1-yl]-ethyl}-isochroman-6-carboxylic acid amide | CHEMBL81703
TypeSmall organic molecule
Emp. Form.C25H25FN2O2S
Mol. Mass.436.542
SMILESNC(=O)c1ccc2C(CCN3CCC(=CC3)c3csc4cc(F)ccc34)OCCc2c1