Reaction Details
TargetD(2) dopamine receptor
LigandBDBM50145356
Substrate/Competitorn/a
Meas. Tech.ChEBML_62254
Ki 6.7±n/a nM
Citation Timms, GHBoot, JRBroadmore, RJCarney, SLCooper, JFindlay, JDGilmore, JMitchell, SMoore, NAPullar, ISanger, GJTomlinson, RTree, BBWedley, S SAR development of a selective 5-HT1D antagonist/serotonin reuptake inhibitor lead using rapid parallel synthesis. Bioorg Med Chem Lett14:2469-72 (2004) 
 
D(2) dopamine receptor
Name:D(2) dopamine receptor
Type:G Protein-Coupled Receptor (GPCR)
Mol. Mass.:50931.60
Organism:Rattus norvegicus (rat)
Description:P61169
Residue:444
BDBM50145356
NameBDBM50145356
Synonyms:1-{2-[4-(6,7-Difluoro-1H-indol-3-yl)-3,6-dihydro-2H-pyridin-1-yl]-ethyl}-isochroman-6-carboxylic acid amide | CHEMBL82523
TypeSmall organic molecule
Emp. Form.C25H25F2N3O2
Mol. Mass.437.4817
SMILESNC(=O)c1ccc2C(CCN3CCC(=CC3)c3c[nH]c4c(F)c(F)ccc34)OCCc2c1