Reaction Details
TargetSodium-dependent serotonin transporter
LigandBDBM50145346
Substrate/Competitorn/a
Meas. Tech.ChEBML_201998
Ki 0.990000±n/a nM
Citation Timms, GHBoot, JRBroadmore, RJCarney, SLCooper, JFindlay, JDGilmore, JMitchell, SMoore, NAPullar, ISanger, GJTomlinson, RTree, BBWedley, S SAR development of a selective 5-HT1D antagonist/serotonin reuptake inhibitor lead using rapid parallel synthesis. Bioorg Med Chem Lett14:2469-72 (2004) 
 
Sodium-dependent serotonin transporter
Name:Sodium-dependent serotonin transporter
Type:Multi-pass membrane protein
Mol. Mass.:70168.43
Organism:Rattus norvegicus (rat)
Description:P31652
Residue:630
BDBM50145346
NameBDBM50145346
Synonyms:1-{2-[4-(6-Trifluoromethyl-1H-indol-3-yl)-3,6-dihydro-2H-pyridin-1-yl]-ethyl}-isochroman-6-carboxylic acid amide | CHEMBL313452
TypeSmall organic molecule
Emp. Form.C26H26F3N3O2
Mol. Mass.469.4987
SMILESNC(=O)c1ccc2C(CCN3CCC(=CC3)c3c[nH]c4cc(ccc34)C(F)(F)F)OCCc2c1