Reaction Details
TargetEpidermal growth factor receptor
LigandBDBM50141152
Substrate/Competitorn/a
Meas. Tech.ChEBML_63781
IC50>10000±n/a nM
Citation Wissner, AHamann, PRNilakantan, RGreenberger, LMYe, FRapuano, TALoganzo, F Syntheses and EGFR kinase inhibitory activity of 6-substituted-4-anilino [1,7] and [1,8] naphthyridine-3-carbonitriles. Bioorg Med Chem Lett14:1411-6 (2004) 
 
Epidermal growth factor receptor
Name:Epidermal growth factor receptor
Type:Receptor Kinase Domain
Mol. Mass.:134279.59
Organism:Homo sapiens (Human)
Description:P00533
Residue:1210
BDBM50141152
NameBDBM50141152
Synonyms:4-(3-Bromo-phenylamino)-6-(2-dimethylamino-ethoxy)-[1,7]naphthyridine-3-carbonitrile | CHEMBL31118
TypeSmall organic molecule
Emp. Form.C19H18BrN5O
Mol. Mass.412.283
SMILESCN(C)CCOc1cc2c(Nc3cccc(Br)c3)c(cnc2cn1)C#N