Reaction Details
TargetIntegrase
LigandBDBM50056891
Substrate/Competitorn/a
Meas. Tech.ChEMBL_90870 (CHEMBL699303)
IC50 700±n/a nM
Citation Mustata, GIBrigo, ABriggs, JM HIV-1 integrase pharmacophore model derived from diverse classes of inhibitors. Bioorg Med Chem Lett14:1447-54 (2004) 
 
Integrase
Name:Integrase
Synonyms:Human immunodeficiency virus type 1 integrase
Type:PROTEIN
Mol. Mass.:32231.48
Organism:Human immunodeficiency virus 1
Description:ChEMBL_90865
Residue:288
BDBM50056891
NameBDBM50056891
TypeSmall organic molecule
Emp. Form.C14H12N2O4
Mol. Mass.272.2561
SMILESOc1ccccc1C(=O)NNC(=O)c1ccccc1O