Reaction Details
TargetDelta-type opioid receptor
LigandBDBM50221787
Substrate/Competitorn/a
Meas. Tech.ChEMBL_147053 (CHEMBL753280)
Ki 13±n/a nM
Citation Jinsmaa, YMiyazaki, AFujita, YLi, TFujisawa, YShiotani, KTsuda, YYokoi, TAmbo, ASasaki, YBryant, SDLazarus, LHOkada, Y Oral bioavailability of a new class of micro-opioid receptor agonists containing 3,6-bis[Dmt-NH(CH(2))(n)]-2(1H)-pyrazinone with central-mediated analgesia. J Med Chem47:2599-610 (2004) 
 
Delta-type opioid receptor
Name:Delta-type opioid receptor
Type:G Protein-Coupled Receptor (GPCR)
Mol. Mass.:40465.04
Organism:Rattus norvegicus (rat)
Description:Competition binding assays were using CHO-K1 cell membranes expressing the opioid receptor.
Residue:372
BDBM50221787
NameBDBM50221787
Synonyms:CHEMBL3216418
TypeSmall organic molecule
Emp. Form.C33H48Cl2N6O5
Mol. Mass.679.677
SMILESCl.Cl.Cc1cc(O)cc(C)c1CC(N)C(=O)NCCCc1nc(O)c(CCCNC(=O)C(N)Cc2c(C)cc(O)cc2C)nc1C