Reaction Details
TargetMu-type opioid receptor
LigandBDBM50221778
Substrate/Competitorn/a
Meas. Tech.ChEMBL_146985 (CHEMBL757523)
IC50 1.9±n/a nM
Citation Jinsmaa, YMiyazaki, AFujita, YLi, TFujisawa, YShiotani, KTsuda, YYokoi, TAmbo, ASasaki, YBryant, SDLazarus, LHOkada, Y Oral bioavailability of a new class of micro-opioid receptor agonists containing 3,6-bis[Dmt-NH(CH(2))(n)]-2(1H)-pyrazinone with central-mediated analgesia. J Med Chem47:2599-610 (2004) 
 
Mu-type opioid receptor
Name:Mu-type opioid receptor
Type:Enzyme Catalytic Domain
Mol. Mass.:11165.58
Organism:GUINEA PIG
Description:P97266
Residue:98
BDBM50221778
NameBDBM50221778
Synonyms:CHEMBL3216392
TypeSmall organic molecule
Emp. Form.C35H52Cl2N6O5
Mol. Mass.707.731
SMILESCl.Cl.Cc1cc(O)cc(C)c1CC(N)C(=O)NCCCCc1nc(O)c(CCCCNC(=O)C(N)Cc2c(C)cc(O)cc2C)nc1C