Reaction Details
TargetTransporter
LigandBDBM50146043
Substrate/Competitorn/a
Meas. Tech.ChEBML_143127
Ki 7±n/a nM
Citation Yu, HKim, IJFolk, JETian, XRothman, RBBaumann, MHDersch, CMFlippen-Anderson, JLParrish, DJacobson, AERice, KC Synthesis and pharmacological evaluation of 3-(3,4-dichlorophenyl)-1-indanamine derivatives as nonselective ligands for biogenic amine transporters. J Med Chem47:2624-34 (2004) 
 
Transporter
Name:Transporter
Type:PROTEIN
Mol. Mass.:66787.87
Organism:Rattus norvegicus
Description:ChEMBL_1463061
Residue:597
BDBM50146043
NameBDBM50146043
Synonyms:CHEMBL543372 | [(1R,3S)-3-(3,4-Dichloro-phenyl)-6-methoxy-indan-1-yl]-methyl-amine; hydrochloride
TypeSmall organic molecule
Emp. Form.C17H17Cl2NO
Mol. Mass.322.229
SMILESCN[C@@H]1C[C@H](c2ccc(OC)cc12)c1ccc(Cl)c(Cl)c1