Reaction Details
TargetSodium-dependent serotonin transporter
LigandBDBM50146040
Substrate/Competitorn/a
Meas. Tech.ChEMBL_202134 (CHEMBL808123)
Ki 2±n/a nM
Citation Yu, HKim, IJFolk, JETian, XRothman, RBBaumann, MHDersch, CMFlippen-Anderson, JLParrish, DJacobson, AERice, KC Synthesis and pharmacological evaluation of 3-(3,4-dichlorophenyl)-1-indanamine derivatives as nonselective ligands for biogenic amine transporters. J Med Chem47:2624-34 (2004) 
 
Sodium-dependent serotonin transporter
Name:Sodium-dependent serotonin transporter
Type:Multi-pass membrane protein
Mol. Mass.:70168.43
Organism:Rattus norvegicus (rat)
Description:P31652
Residue:630
BDBM50146040
NameBDBM50146040
Synonyms:(1R,3S)-1-(3,4-Dichloro-phenyl)-3-methylamino-indan-5-ol | CHEMBL89142
TypeSmall organic molecule
Emp. Form.C16H15Cl2NO
Mol. Mass.308.202
SMILESCN[C@H]1C[C@@H](c2ccc(O)cc12)c1ccc(Cl)c(Cl)c1