Reaction Details
TargetSodium-dependent serotonin transporter
LigandBDBM50146043
Substrate/Competitorn/a
Meas. Tech.ChEMBL_201986 (CHEMBL809431)
Ki 0.700000±n/a nM
Citation Yu, HKim, IJFolk, JETian, XRothman, RBBaumann, MHDersch, CMFlippen-Anderson, JLParrish, DJacobson, AERice, KC Synthesis and pharmacological evaluation of 3-(3,4-dichlorophenyl)-1-indanamine derivatives as nonselective ligands for biogenic amine transporters. J Med Chem47:2624-34 (2004) 
 
Sodium-dependent serotonin transporter
Name:Sodium-dependent serotonin transporter
Type:Multi-pass membrane protein
Mol. Mass.:70168.43
Organism:Rattus norvegicus (rat)
Description:P31652
Residue:630
BDBM50146043
NameBDBM50146043
Synonyms:CHEMBL543372 | [(1R,3S)-3-(3,4-Dichloro-phenyl)-6-methoxy-indan-1-yl]-methyl-amine; hydrochloride
TypeSmall organic molecule
Emp. Form.C17H17Cl2NO
Mol. Mass.322.229
SMILESCN[C@@H]1C[C@H](c2ccc(OC)cc12)c1ccc(Cl)c(Cl)c1