Reaction Details
TargetTransporter
LigandBDBM50029150
Substrate/Competitorn/a
Meas. Tech.ChEBML_178953
IC50 1600±n/a nM
Citation Gueremy, CAudiau, FChampseix, naUzan, ALe Fur, GRataud, J 3-(4-Piperidinylalkyl)indoles, selective inhibitors of neuronal 5-hydroxytryptamine uptake. J Med Chem23:1306-10 (1981) Transporter
Name:Transporter
Type:PROTEIN
Mol. Mass.:66787.87
Organism:Rattus norvegicus
Description:ChEMBL_1463061
Residue:597
BDBM50029150
NameBDBM50029150
Synonyms:3-(2-Piperidin-4-yl-ethyl)-1H-indole Indalpine
TypeSmall organic molecule
Emp. Form.C15H20N2
Mol. Mass.228.3327
SMILESC(Cc1c[nH]c2ccccc12)C1CCNCC1