Reaction Details
TargetPhenylethanolamine N-methyltransferase
LigandBDBM50028783
Substrate/Competitorn/a
Meas. Tech.ChEBML_152417
IC50 8000±n/a nM
Citation Davis, DPBorchardt, RTGrunewald, GL Importance of the aromatic ring in adrenergic amines. 6. Nonaromatic analogues of phenylethanolamine as inhibitors of phenylethanolamine N-methyltransferase: role of pi-electronic and steric interactions. J Med Chem24:12-6 (1981) Phenylethanolamine N-methyltransferase
Name:Phenylethanolamine N-methyltransferase
Type:Enzyme
Mol. Mass.:30916.97
Organism:Bos taurus (bovine)
Description:n/a
Residue:283
BDBM50028783
NameBDBM50028783
Synonyms:2-Amino-1-cyclooctyl-ethanol CHEMBL18686
TypeSmall organic molecule
Emp. Form.C10H21NO
Mol. Mass.171.2798
SMILESNCC(O)C1CCCCCCC1