Reaction Details
TargetThymidylate synthase
LigandBDBM50022238
Substrate/Competitorn/a
Meas. Tech.ChEBML_217696
Ki 10.0±n/a nM
Citation Nakayama, CWataya, YSanti, DVSaneyoshi, MUeda, T Interaction of 1-(5-phospho-beta-D-arabinofuranosyl)-5-substituted-uracils with thymidylate synthetase: mechanism-based inhibition by 1-(5-phospho-beta-D-arabinosyl)-5-fluorouracil. J Med Chem24:1161-5 (1982) Thymidylate synthase
Name:Thymidylate synthase
Type:n/a
Mol. Mass.:30487.86
Organism:Escherichia coli
Description:n/a
Residue:264
BDBM50022238
NameBDBM50022238
Synonyms:(R)-5-Fluoro-1-((4S,5R)-4-hydroxy-5-methylphosphate-tetrahydro-furan-2-yl)-1H-pyrimidine-2,4-dione 5-Fluoro-2-Deoxyuridine Monophosphate (Fdump) Phosphoric acid mono-[(2R,3S,5R)-5-(5-fluoro-2,4-dioxo-3,4-dihydro-2H-pyrimidin-1-yl)-3-hydroxy-tetrahydro-furan-2-ylmethyl] ester | Phosphoric acid mono-[5-(5-fluoro-2,4-dioxo-3,4-dihydro-2H-pyrimidin-1-yl)-3-hydroxy-tetrahydro-furan-2-ylmethyl] ester
TypeSmall organic molecule
Emp. Form.C9H12FN2O8P
Mol. Mass.326.1723
SMILESO[C@H]1C[C@@H](O[C@@H]1COP(O)(O)=O)n1cc(F)c(=O)[nH]c1=O