Reaction Details
TargetThymidylate synthase
LigandBDBM50421668
Substrate/Competitorn/a
Meas. Tech.ChEBML_217696
Ki 120000±n/a nM
Citation Nakayama, CWataya, YSanti, DVSaneyoshi, MUeda, T Interaction of 1-(5-phospho-beta-D-arabinofuranosyl)-5-substituted-uracils with thymidylate synthetase: mechanism-based inhibition by 1-(5-phospho-beta-D-arabinosyl)-5-fluorouracil. J Med Chem24:1161-5 (1982) Thymidylate synthase
Name:Thymidylate synthase
Type:n/a
Mol. Mass.:30487.86
Organism:Escherichia coli
Description:n/a
Residue:264
BDBM50421668
NameBDBM50421668
Synonyms:CHEMBL2311177
TypeSmall organic molecule
Emp. Form.C10H16N3O8P
Mol. Mass.337.2231
SMILESCc1cn([C@@H]2O[C@H](COP(O)(O)=O)[C@@H](O)[C@@H]2O)c(=O)nc1N