Reaction Details
TargetCatechol O-methyltransferase
LigandBDBM50366942
Substrate/Competitorn/a
Meas. Tech.ChEBML_47238
Ki 6000000±n/a nM
Citation Anderson, GLBussolotti, DLCoward, JK Synthesis and evaluation of some stable multisubstrate adducts as inhibitors of catechol O-methyltransferase. J Med Chem24:1271-7 (1982) Catechol O-methyltransferase
Name:Catechol O-methyltransferase
Type:Enzyme
Mol. Mass.:30030.67
Organism:Homo sapiens (Human)
Description:P21964
Residue:271
BDBM50366942
NameBDBM50366942
Synonyms:CHEMBL540135
TypeSmall organic molecule
Emp. Form.C12H18N5O3S
Mol. Mass.312.367
SMILESC[S+](C)C[C@H]1O[C@H]([C@H](O)[C@@H]1O)n1cnc2c(N)ncnc12