Reaction Details
TargetAdenosine deaminase
LigandBDBM28393
Substrate/Competitorn/a
Meas. Tech.ChEBML_30975
Ki 2±n/a nM
Citation Bastian, GBessodes, MPanzica, RPAbushanab, EChen, SFStoeckler, JDParks, RE Adenosine deaminase inhibitors. Conversion of a single chiral synthon into erythro- and threo-9-(2-hydroxy-3-nonyl)adenines. J Med Chem24:1383-5 (1982) Adenosine deaminase
Name:Adenosine deaminase
Type:Enzyme
Mol. Mass.:40759.44
Organism:Homo sapiens (Human)
Description:Human recombinant ADA was expressed and purified from an ADA-deficient bacterial strain.
Residue:363
BDBM28393
NameBDBM28393
Synonyms:(+)-EHNA CHEMBL296435
TypeSmall organic molecule
Emp. Form.C14H23N5O
Mol. Mass.277.3653
SMILESCCCCCC[C@H]([C@H](C)O)n1cnc2c(N)ncnc12