Reaction Details
TargetDihydrofolate reductase
LigandBDBM50028603
Substrate/Competitorn/a
Meas. Tech.ChEBML_54601
Ki 0.500000±n/a nM
Citation Piper, JRMcCaleb, GSMontgomery, JAKisliuk, RLGaumont, YSirotnak, FM 10-Propargylaminopterin and alkyl homologues of methotrexate as inhibitors of folate metabolism. J Med Chem25:877-80 (1982) Dihydrofolate reductase
Name:Dihydrofolate reductase
Type:Enzyme
Mol. Mass.:21608.82
Organism:Mus musculus (Mouse)
Description:n/a
Residue:187
BDBM50028603
NameBDBM50028603
Synonyms:2-{4-[(2,4-Diamino-pteridin-6-ylmethyl)-prop-2-ynyl-amino]-benzoylamino}-pentanedioic acid | CHEMBL166915
TypeSmall organic molecule
Emp. Form.C22H22N8O5
Mol. Mass.478.4607
SMILESNc1nc(N)c2nc(CN(CC#C)c3ccc(cc3)C(=O)NC(CCC(O)=O)C(O)=O)cnc2n1