Reaction Details
TargetDihydrofolate reductase
LigandBDBM50028604
Substrate/Competitorn/a
Meas. Tech.ChEBML_54601
Ki 18±n/a nM
Citation Piper, JRMcCaleb, GSMontgomery, JAKisliuk, RLGaumont, YSirotnak, FM 10-Propargylaminopterin and alkyl homologues of methotrexate as inhibitors of folate metabolism. J Med Chem25:877-80 (1982) Dihydrofolate reductase
Name:Dihydrofolate reductase
Type:Enzyme
Mol. Mass.:21608.82
Organism:Mus musculus (Mouse)
Description:n/a
Residue:187
BDBM50028604
NameBDBM50028604
Synonyms:2-{4-[(2,4-Diamino-pteridin-6-ylmethyl)-octyl-amino]-benzoylamino}-pentanedioic acid | CHEMBL171757
TypeSmall organic molecule
Emp. Form.C27H36N8O5
Mol. Mass.552.6253
SMILESCCCCCCCCN(Cc1cnc2nc(N)nc(N)c2n1)c1ccc(cc1)C(=O)NC(CCC(O)=O)C(O)=O