Reaction Details
TargetBeta-2 adrenergic receptor
LigandBDBM50026853
Substrate/Competitorn/a
Meas. Tech.ChEBML_37821
IC50 25±n/a nM
Citation Baldwin, JJMcClure, DEGross, DMWilliams, M Use of (S)-(trifloxymethyl)oxirane in the synthesis of a chiral beta-adrenoceptor antagonist, (R)- and (S)-9-[[3-(tert-butylamino)-2-hydroxypropyl]oximino]fluorene. J Med Chem25:931-6 (1982) Beta-2 adrenergic receptor
Name:Beta-2 adrenergic receptor
Type:Enzyme Catalytic Domain
Mol. Mass.:47141.18
Organism:BOVINE
Description:adrenergic Beta ADRB2 BOVINE::Q28044
Residue:418
BDBM50026853
NameBDBM50026853
Synonyms:CHEMBL368457 | Fluoren-9-one O-(3-tert-butylamino-2-hydroxy-propyl)-oxime
TypeSmall organic molecule
Emp. Form.C20H24N2O2
Mol. Mass.324.4168
SMILES[#6]C([#6])([#6])[#7]-[#6]-[#6](-[#8])-[#6]-[#8]\[#7]=[#6]-1\c2ccccc2-c2ccccc-12