Reaction Details
TargetAlpha-1A adrenergic receptor
LigandBDBM50026967
Substrate/Competitorn/a
Meas. Tech.ChEBML_33098
Ki 13±n/a nM
Citation Remy, DCBritcher, SFKing, SWAnderson, PSHunt, CARandall, WCBélanger, PAtkinson, JGGirard, YRooney, CSFuentes, JJTotaro, JARobinson, JLRisley, EAWilliams, M Synthesis and receptor binding studies relevant to the neuroleptic activities of some 1-methyl-4-piperidylidene-9-substituted-pyrrolo[2,1-b][3]benzazepine derivatives. J Med Chem26:974-80 (1983) Alpha-1A adrenergic receptor
Name:Alpha-1A adrenergic receptor
Type:Enzyme Catalytic Domain
Mol. Mass.:51492.08
Organism:CALF
Description:adrenergic Alpha1 0 CALF
Residue:466
BDBM50026967
NameBDBM50026967
Synonyms:11-(1-Methyl-piperidin-4-ylidene)-9-trifluoromethylsulfanyl-11H-benzo[d]pyrrolo[1,2-a]azepine | CHEMBL424967
TypeSmall organic molecule
Emp. Form.C20H19F3N2S
Mol. Mass.376.438
SMILES[#6]-[#7]-1-[#6]-[#6]\[#6](-[#6]-[#6]-1)=[#6]-1/c2cccn2-[#6]=[#6]-c2ccc(-[#16]C(F)(F)F)cc-12