Reaction Details
TargetAngiotensin-converting enzyme
LigandBDBM50020766
Substrate/Competitorn/a
Meas. Tech.ChEBML_34789
IC50 7±n/a nM
Citation Stanton, JLGruenfeld, NBabiarz, JEAckerman, MHFriedmann, RCYuan, AMMacchia, W Angiotensin converting enzyme inhibitors: N-substituted monocyclic and bicyclic amino acid derivatives. J Med Chem26:1267-77 (1983) Angiotensin-converting enzyme
Name:Angiotensin-converting enzyme
Type:n/a
Mol. Mass.:150405.15
Organism:Oryctolagus cuniculus
Description:n/a
Residue:1310
BDBM50020766
NameBDBM50020766
Synonyms:(R+S)-[Cyclopentyl-(3-mercapto-2-methyl-propionyl)-amino]-acetic acid CHEMBL1788151 [Cyclopentyl-(3-mercapto-2-methyl-propionyl)-amino]-acetic acid; Dicyclohexyl amine salt
TypeSmall organic molecule
Emp. Form.C11H19NO3S
Mol. Mass.245.338
SMILESCC(CS)C(=O)N(CC(O)=O)C1CCCC1