Reaction Details
TargetDNA polymerase alpha catalytic subunit
LigandBDBM50405103
Substrate/Competitorn/a
Meas. Tech.ChEMBL_50810 (CHEMBL658011)
Ki 37000±n/a nM
Citation Wright, GEDudycz, LW Synthesis and characterization of N2-(p-n-butylphenyl)-2'-deoxyguanosine and its 5'-triphosphate and their inhibition of HeLa DNA polymerase alpha. J Med Chem27:175-81 (1984) DNA polymerase alpha catalytic subunit
Name:DNA polymerase alpha catalytic subunit
Type:PROTEIN
Mol. Mass.:165895.25
Organism:Homo sapiens (Human)
Description:ChEMBL_1365493
Residue:1462
BDBM50405103
NameBDBM50405103
Synonyms:CHEMBL2115349
TypeSmall organic molecule
Emp. Form.C20H25N5O4
Mol. Mass.399.4436
SMILESCCCCc1ccc(Nc2nc3n(cnc3c(=O)[nH]2)[C@H]2C[C@H](O)[C@@H](CO)O2)cc1